Target
Kallikrein-1
Ligand
BDBM50140416
Substrate
Meas. Tech.
ChEBML_92384
IC50
>10000±n/a nM
Citation
 Jia, ZJWu, YHuang, WZhang, PSong, YWoolfrey, JSinha, UArfsten, AEEdwards, STHutchaleelaha, AHollennbach, SJLambing, JLScarborough, RMZhu, BY 1-(2-Naphthyl)-1H-pyrazole-5-carboxylamides as potent factor Xa inhibitors. Part 3: Design, synthesis and SAR of orally bioavailable benzamidine-P4 inhibitors. Bioorg Med Chem Lett 14:1229-34 (2004)  
Target
Name:
Kallikrein-1
Synonyms:
KLK1 Kallikrein 1 Kidney/pancreas/salivary gland kallikrein | Tissue kallikrein
Type:
Enzyme
Mol. Mass.:
28874.69
Organism:
Homo sapiens (Human)
Description:
P06870
Residue:
262
  
Inhibitor
Name:
BDBM50140416
Synonyms:
2-(3-Fluoro-naphthalen-2-yl)-5-methyl-2H-pyrazole-3-carboxylic acid [2-fluoro-4-(1-methyl-4,5-dihydro-1H-imidazol-2-yl)-phenyl]-amide | CHEMBL21052
Type:
Small organic molecule
Emp. Form.:
C25H21F2N5O
Mol. Mass.:
445.4639
SMILES:
CN1CCN=C1c1ccc(NC(=O)c2cc(C)nn2-c2cc3ccccc3cc2F)c(F)c1
: