Target
Plasminogen
Ligand
BDBM50140424
Substrate
Meas. Tech.
ChEBML_155588
IC50
>10000±n/a nM
Citation
 Jia, ZJWu, YHuang, WZhang, PSong, YWoolfrey, JSinha, UArfsten, AEEdwards, STHutchaleelaha, AHollennbach, SJLambing, JLScarborough, RMZhu, BY 1-(2-Naphthyl)-1H-pyrazole-5-carboxylamides as potent factor Xa inhibitors. Part 3: Design, synthesis and SAR of orally bioavailable benzamidine-P4 inhibitors. Bioorg Med Chem Lett 14:1229-34 (2004)  
Target
Name:
Plasminogen
Synonyms:
PLMN_RAT Plasminogen | Plg
Type:
Protein
Mol. Mass.:
90541.87
Organism:
Rattus norvegicus
Description:
Q01177
Residue:
812
  
Inhibitor
Name:
BDBM50140424
Synonyms:
2-(6-Chloro-naphthalen-2-yl)-5-methyl-2H-pyrazole-3-carboxylic acid [4-(N,N-dimethyl-carbamimidoyl)-2-fluoro-phenyl]-amide | CHEMBL20918
Type:
Small organic molecule
Emp. Form.:
C24H21ClFN5O
Mol. Mass.:
449.908
SMILES:
CN(C)C(=N)c1ccc(NC(=O)c2cc(C)nn2-c2ccc3cc(Cl)ccc3c2)c(F)c1
: