Target
Dipeptidyl peptidase 2
Ligand
BDBM50140527
Substrate
Meas. Tech.
ChEBML_160555
IC50
20000±n/a nM
Citation
 Caldwell, CGChen, PHe, JParmee, ERLeiting, BMarsilio, FPatel, RAWu, JKEiermann, GJPetrov, AHe, HLyons, KAThornberry, NAWeber, AE Fluoropyrrolidine amides as dipeptidyl peptidase IV inhibitors. Bioorg Med Chem Lett 14:1265-8 (2004)  
Target
Name:
Dipeptidyl peptidase 2
Synonyms:
DAP II DPP2_HUMAN Dipeptidyl aminopeptidase II Dipeptidyl peptidase 2 (DPP2) Dipeptidyl peptidase II (DPP II) Dipeptidyl peptidase II and dipeptidyl peptidase IV (DPP2 and DPP4) carboxytripeptidase dipeptidyl(amino)peptidase II | dipeptidylarylamidase
Type:
Protein
Mol. Mass.:
54339.29
Organism:
Homo sapiens (Human)
Description:
Q9UHL4
Residue:
492
  
Inhibitor
Name:
BDBM50140527
Synonyms:
(S)-2-Amino-2-cyclohexyl-1-((S)-3-fluoro-pyrrolidin-1-yl)-ethanone | CHEMBL22511
Type:
Small organic molecule
Emp. Form.:
C12H21FN2O
Mol. Mass.:
228.3063
SMILES:
N[C@@H](C1CCCCC1)C(=O)N1CC[C@H](F)C1
: