Target
Potassium voltage-gated channel subfamily H member 2
Ligand
BDBM50140535
Substrate
Meas. Tech.
ChEBML_65269
Ki
5500±n/a nM
Citation
 Caldwell, CGChen, PHe, JParmee, ERLeiting, BMarsilio, FPatel, RAWu, JKEiermann, GJPetrov, AHe, HLyons, KAThornberry, NAWeber, AE Fluoropyrrolidine amides as dipeptidyl peptidase IV inhibitors. Bioorg Med Chem Lett 14:1265-8 (2004)  
Target
Name:
Potassium voltage-gated channel subfamily H member 2
Synonyms:
1,3-beta-glucan synthase component GLS2 ERG Eag-related protein 1 Ether-a-go-go-related gene (HERG) Ether-a-go-go-related gene potassium channel 1 Ether-a-go-go-related gene potassium channel 1 (hERG1) Ether-a-go-go-related protein 1 H-ERG KCNH2 Potassium voltage-gated channel subfamily H member 2 (hERG) Voltage-gated potassium channel subunit Kv11.1 hERG Potassium Channel 1 | putative potassium channel subunit
Type:
Multi-pass membrane protein
Mol. Mass.:
126672.65
Organism:
Homo sapiens (Human)
Description:
Q12809
Residue:
1159
  
Inhibitor
Name:
BDBM50140535
Synonyms:
CHEMBL281178 | N-{4-[(S)-1-Amino-2-((S)-3-fluoro-pyrrolidin-1-yl)-2-oxo-ethyl]-cyclohexyl}-4-trifluoromethoxy-benzenesulfonamide
Type:
Small organic molecule
Emp. Form.:
C19H25F4N3O4S
Mol. Mass.:
467.478
SMILES:
N[C@@H]([C@H]1CC[C@@H](CC1)NS(=O)(=O)c1ccc(OC(F)(F)F)cc1)C(=O)N1CC[C@H](F)C1
: