Target
Dipeptidyl peptidase 2
Ligand
BDBM50140534
Substrate
Meas. Tech.
ChEBML_160555
IC50
7500±n/a nM
Citation
 Caldwell, CGChen, PHe, JParmee, ERLeiting, BMarsilio, FPatel, RAWu, JKEiermann, GJPetrov, AHe, HLyons, KAThornberry, NAWeber, AE Fluoropyrrolidine amides as dipeptidyl peptidase IV inhibitors. Bioorg Med Chem Lett 14:1265-8 (2004)  
Target
Name:
Dipeptidyl peptidase 2
Synonyms:
DAP II DPP2_HUMAN Dipeptidyl aminopeptidase II Dipeptidyl peptidase 2 (DPP2) Dipeptidyl peptidase II (DPP II) Dipeptidyl peptidase II and dipeptidyl peptidase IV (DPP2 and DPP4) carboxytripeptidase dipeptidyl(amino)peptidase II | dipeptidylarylamidase
Type:
Protein
Mol. Mass.:
54339.29
Organism:
Homo sapiens (Human)
Description:
Q9UHL4
Residue:
492
  
Inhibitor
Name:
BDBM50140534
Synonyms:
CHEMBL431885 | N-{4-[(S)-1-Amino-2-((3S,4S)-3,4-difluoro-pyrrolidin-1-yl)-2-oxo-ethyl]-cyclohexyl}-4-trifluoromethoxy-benzenesulfonamide
Type:
Small organic molecule
Emp. Form.:
C19H24F5N3O4S
Mol. Mass.:
485.469
SMILES:
N[C@@H]([C@H]1CC[C@@H](CC1)NS(=O)(=O)c1ccc(OC(F)(F)F)cc1)C(=O)N1C[C@H](F)[C@@H](F)C1
: