Target
Metallo-beta-lactamase L1 type 3
Ligand
BDBM50157692
Substrate
Meas. Tech.
ChEMBL_104646 (CHEMBL712892)
IC50
>200000±n/a nM
Citation
 Buynak, JDChen, HVogeti, LGadhachanda, VRBuchanan, CAPalzkill, TShaw, RWSpencer, JWalsh, TR Penicillin-derived inhibitors that simultaneously target both metallo- and serine-beta-lactamases. Bioorg Med Chem Lett 14:1299-304 (2004)  
Target
Name:
Metallo-beta-lactamase L1 type 3
Synonyms:
BLA1_STEMA | Beta-lactamase L1
Type:
PROTEIN
Mol. Mass.:
30803.13
Organism:
Stenotrophomonas maltophilia
Description:
ChEMBL_1500319
Residue:
290
  
Inhibitor
Name:
BDBM50157692
Synonyms:
CHEMBL1439 Sodium; (2S,3S,5R)-3-methyl-4,4,7-trioxo-3-[1,2,3]triazol-1-ylmethyl-4lambda*6*-thia-1-aza-bicyclo[3.2.0]heptane-2-carboxylate US9035062, TAZ tazobactum
Type:
Small organic molecule
Emp. Form.:
C10H11N4NaO5S
Mol. Mass.:
322.273
SMILES:
C[C@]1(Cn2ccnn2)[C@@H](N2[C@@H](CC2=O)S1(=O)=O)C(=O)O[Na]
: