Target
Metallo-beta-lactamase type 2
Ligand
BDBM50140670
Substrate
Meas. Tech.
ChEMBL_104645 (CHEMBL712891)
IC50
17200±n/a nM
Citation
 Buynak, JDChen, HVogeti, LGadhachanda, VRBuchanan, CAPalzkill, TShaw, RWSpencer, JWalsh, TR Penicillin-derived inhibitors that simultaneously target both metallo- and serine-beta-lactamases. Bioorg Med Chem Lett 14:1299-304 (2004)  
Target
Name:
Metallo-beta-lactamase type 2
Synonyms:
BLAB_BACCE Metallo-beta-lactamase domain-containing protein 2 | Metallo-beta-lactamase superfamily protein
Type:
PROTEIN
Mol. Mass.:
28044.00
Organism:
Bacillus cereus
Description:
ChEMBL_104097
Residue:
256
  
Inhibitor
Name:
BDBM50140670
Synonyms:
(2S,5R,6S)-6-Mercapto-3,3-dimethyl-7-oxo-4-thia-1-aza-bicyclo[3.2.0]heptane-2-carboxylic acid | CHEMBL24275
Type:
Small organic molecule
Emp. Form.:
C8H11NO3S2
Mol. Mass.:
233.308
SMILES:
CC1(C)S[C@@H]2[C@@H](S)C(=O)N2[C@H]1C(O)=O
: