Target
Phenylalanine--tRNA ligase, mitochondrial
Ligand
BDBM50140713
Substrate
Meas. Tech.
ChEBML_154873
IC50
>100000±n/a nM
Citation
 Yu, XYFinn, JHill, JMWang, ZGKeith, DSilverman, JOliver, N A series of spirocyclic analogues as potent inhibitors of bacterial phenylalanyl-tRNA synthetases. Bioorg Med Chem Lett 14:1339-42 (2004)  
Target
Name:
Phenylalanine--tRNA ligase, mitochondrial
Synonyms:
FARS1 PheRS Phenylalanyl-tRNA synthetase mitochondrial SYFM_HUMAN
Type:
PROTEIN
Mol. Mass.:
52367.99
Organism:
Homo sapiens (Human)
Description:
ChEMBL_154870
Residue:
451
  
Inhibitor
Name:
BDBM50140713
Synonyms:
4-benzoyl-2-(3,4-dichlorophenyl)-6-phenyl-(3aR,6R,6aS)-perhydropyrrolo[3,4-c]pyrrole-1,3-dione CHEMBL435161
Type:
Small organic molecule
Emp. Form.:
C25H18Cl2N2O3
Mol. Mass.:
465.328
SMILES:
Oc1c2C(NC(c2c(O)n1-c1ccc(Cl)c(Cl)c1)c1ccccc1)C(=O)c1ccccc1
: