Target
Phenylalanine--tRNA ligase alpha subunit
Ligand
BDBM50140704
Substrate
Meas. Tech.
ChEMBL_154872 (CHEMBL768846)
IC50
45000±n/a nM
Citation
 Yu, XYFinn, JHill, JMWang, ZGKeith, DSilverman, JOliver, N A series of spirocyclic analogues as potent inhibitors of bacterial phenylalanyl-tRNA synthetases. Bioorg Med Chem Lett 14:1339-42 (2004)  
Target
Name:
Phenylalanine--tRNA ligase alpha subunit
Synonyms:
Phenylalanyl-tRNA synthetase alpha chain pheS
Type:
PROTEIN
Mol. Mass.:
39288.40
Organism:
Streptococcus pyogenes serotype M18
Description:
ChEMBL_154869
Residue:
347
  
Inhibitor
Name:
BDBM50140704
Synonyms:
5-(4-chloro-3-trifluoromethylphenyl)-3-phenyl-(3R,3aS,6aR)-spiro[perhydrofuro[3,4-c]pyrrole-1,2'-(2',3'-dihydro-1'H-indene)]-1',3',4,6-tetraone | CHEMBL287211
Type:
Small organic molecule
Emp. Form.:
C27H15ClF3NO5
Mol. Mass.:
525.86
SMILES:
Oc1c2C(OC3(C(=O)c4ccccc4C3=O)c2c(O)n1-c1ccc(Cl)c(c1)C(F)(F)F)c1ccccc1
: