Target
Phenylalanine--tRNA ligase, mitochondrial
Ligand
BDBM50140709
Substrate
Meas. Tech.
ChEBML_154873
IC50
>100000±n/a nM
Citation
 Yu, XYFinn, JHill, JMWang, ZGKeith, DSilverman, JOliver, N A series of spirocyclic analogues as potent inhibitors of bacterial phenylalanyl-tRNA synthetases. Bioorg Med Chem Lett 14:1339-42 (2004)  
Target
Name:
Phenylalanine--tRNA ligase, mitochondrial
Synonyms:
FARS1 PheRS Phenylalanyl-tRNA synthetase mitochondrial SYFM_HUMAN
Type:
PROTEIN
Mol. Mass.:
52367.99
Organism:
Homo sapiens (Human)
Description:
ChEMBL_154870
Residue:
451
  
Inhibitor
Name:
BDBM50140709
Synonyms:
5'-(3,4-dichlorophenyl)-3'-phenyl-(3'R,3a'S,6a'R)-spiro[2,3-dihydro-1H-indene-2,1'-perhydropyrrolo[3,4-c]pyrrole]-1,3,4',6'-tetraone CHEMBL281933
Type:
Small organic molecule
Emp. Form.:
C26H16Cl2N2O4
Mol. Mass.:
491.322
SMILES:
Oc1c2C(NC3(C(=O)c4ccccc4C3=O)c2c(O)n1-c1ccc(Cl)c(Cl)c1)c1ccccc1
: