Target
Multidrug resistance-associated protein 1
Ligand
BDBM50140800
Substrate
Meas. Tech.
ChEMBL_103770 (CHEMBL714116)
IC50
887±n/a nM
Citation
 Wang, SFolkes, AChuckowree, ICockcroft, XSohal, SMiller, WMilton, JWren, SPVicker, NDepledge, PScott, JSmith, LJones, HMistry, PFaint, RThompson, DCocks, S Studies on pyrrolopyrimidines as selective inhibitors of multidrug-resistance-associated protein in multidrug resistance. J Med Chem 47:1329-38 (2004)  
Target
Name:
Multidrug resistance-associated protein 1
Synonyms:
7.6.2.2 ABCC1 ATP-binding cassette, sub-family C, member 1 isoform 1 LTC4 transporter MRP MRP1_HUMAN
Type:
Mol. Mass.:
171597.72
Organism:
Homo sapiens (Human)
Description:
P33527
Residue:
1531
  
Inhibitor
Name:
BDBM50140800
Synonyms:
2-Iodo-4-(4-phenethyl-piperazin-1-yl)-6,7,8,9-tetrahydro-pyrimido[4,5-b]indolizine-10-carbonitrile | CHEMBL27823
Type:
Small organic molecule
Emp. Form.:
C23H25IN6
Mol. Mass.:
512.3893
SMILES:
Ic1nc(N2CCN(CCc3ccccc3)CC2)c2n3CCCCc3c(C#N)c2n1
: