Target
Multidrug resistance-associated protein 1
Ligand
BDBM50140855
Substrate
Meas. Tech.
ChEMBL_103769 (CHEMBL714115)
IC50
223±n/a nM
Citation
 Wang, SWan, NCHarrison, JMiller, WChuckowree, ISohal, SHancox, TCBaker, SFolkes, AWilson, FThompson, DCocks, SFarmer, HBoyce, AFreathy, CBroadbridge, JScott, JDepledge, PFaint, RMistry, PCharlton, P Design and synthesis of new templates derived from pyrrolopyrimidine as selective multidrug-resistance-associated protein inhibitors in multidrug resistance. J Med Chem 47:1339-50 (2004)  
Target
Name:
Multidrug resistance-associated protein 1
Synonyms:
7.6.2.2 ABCC1 ATP-binding cassette, sub-family C, member 1 isoform 1 LTC4 transporter MRP MRP1_HUMAN
Type:
Mol. Mass.:
171597.72
Organism:
Homo sapiens (Human)
Description:
P33527
Residue:
1531
  
Inhibitor
Name:
BDBM50140855
Synonyms:
8-{4-[2-(3,4-Difluoro-phenyl)-ethyl]-piperazin-1-yl}-2,9-dimethyl-9H-1,5,7,9-tetraaza-fluorene-4-carboxylic acid amide | CHEMBL287400
Type:
Small organic molecule
Emp. Form.:
C24H25F2N7O
Mol. Mass.:
465.4984
SMILES:
Cc1cc(C(N)=O)c2c(n1)n(C)c1c(ncnc21)N1CCN(CCc2ccc(F)c(F)c2)CC1
: