Target
ATP-dependent translocase ABCB1
Ligand
BDBM50140861
Substrate
Meas. Tech.
ChEMBL_148007 (CHEMBL754165)
IC50
9230±n/a nM
Citation
 Wang, SWan, NCHarrison, JMiller, WChuckowree, ISohal, SHancox, TCBaker, SFolkes, AWilson, FThompson, DCocks, SFarmer, HBoyce, AFreathy, CBroadbridge, JScott, JDepledge, PFaint, RMistry, PCharlton, P Design and synthesis of new templates derived from pyrrolopyrimidine as selective multidrug-resistance-associated protein inhibitors in multidrug resistance. J Med Chem 47:1339-50 (2004)  
Target
Name:
ATP-dependent translocase ABCB1
Synonyms:
Abcb1a MDR1A_MOUSE Mdr3 P-glycoprotein 1 and 3 (MDR1a/MDR1b) Pgy-3 | Pgy3
Type:
Protein
Mol. Mass.:
140669.02
Organism:
Mus musculus (Mouse)
Description:
P21447
Residue:
1276
  
Inhibitor
Name:
BDBM50140861
Synonyms:
4-{4-[2-(3,4-Difluoro-phenyl)-ethyl]-piperazin-1-yl}-8-nitro-5H-pyrimido[5,4-b]indole | CHEMBL25867
Type:
Small organic molecule
Emp. Form.:
C22H20F2N6O2
Mol. Mass.:
438.43
SMILES:
[O-][N+](=O)c1ccc2[nH]c3c(ncnc3c2c1)N1CCN(CCc2ccc(F)c(F)c2)CC1
: