Target
Multidrug resistance-associated protein 1
Ligand
BDBM50140870
Substrate
Meas. Tech.
ChEMBL_103771 (CHEMBL714751)
IC50
78±n/a nM
Citation
 Wang, SWan, NCHarrison, JMiller, WChuckowree, ISohal, SHancox, TCBaker, SFolkes, AWilson, FThompson, DCocks, SFarmer, HBoyce, AFreathy, CBroadbridge, JScott, JDepledge, PFaint, RMistry, PCharlton, P Design and synthesis of new templates derived from pyrrolopyrimidine as selective multidrug-resistance-associated protein inhibitors in multidrug resistance. J Med Chem 47:1339-50 (2004)  
Target
Name:
Multidrug resistance-associated protein 1
Synonyms:
7.6.2.2 ABCC1 ATP-binding cassette, sub-family C, member 1 isoform 1 LTC4 transporter MRP MRP1_HUMAN
Type:
Mol. Mass.:
171597.72
Organism:
Homo sapiens (Human)
Description:
P33527
Residue:
1531
  
Inhibitor
Name:
BDBM50140870
Synonyms:
(4-{4-[2-(3,4-Difluoro-phenyl)-ethyl]-piperazin-1-yl}-8-nitro-pyrimido[5,4-b]indol-5-yl)-acetic acid ethyl ester | CHEMBL26039
Type:
Small organic molecule
Emp. Form.:
C26H26F2N6O4
Mol. Mass.:
524.5192
SMILES:
CCOC(=O)Cn1c2ccc(cc2c2ncnc(N3CCN(CCc4ccc(F)c(F)c4)CC3)c12)[N+]([O-])=O
: