Target
Cytochrome P450 3A4
Ligand
BDBM50140842
Substrate
Meas. Tech.
ChEMBL_52065 (CHEMBL664805)
IC50
1360±n/a nM
Citation
 Wang, SWan, NCHarrison, JMiller, WChuckowree, ISohal, SHancox, TCBaker, SFolkes, AWilson, FThompson, DCocks, SFarmer, HBoyce, AFreathy, CBroadbridge, JScott, JDepledge, PFaint, RMistry, PCharlton, P Design and synthesis of new templates derived from pyrrolopyrimidine as selective multidrug-resistance-associated protein inhibitors in multidrug resistance. J Med Chem 47:1339-50 (2004)  
Target
Name:
Cytochrome P450 3A4
Synonyms:
Albendazole monooxygenase CP3A4_HUMAN CYP3A4 CYPIIIA4 Cytochrome P450 3A4 (CYP3A4) Nifedipine oxidase Taurochenodeoxycholate 6-alpha-hydroxylase
Type:
Enzyme
Mol. Mass.:
57349.57
Organism:
Homo sapiens (Human)
Description:
Residue:
503
  
Inhibitor
Name:
BDBM50140842
Synonyms:
4-{4-[2-(3,4-Difluoro-phenyl)-ethyl]-piperazin-1-yl}-5H-pyrimido[5,4-b]indole-9-carboxylic acid amide | CHEMBL283438
Type:
Small organic molecule
Emp. Form.:
C23H22F2N6O
Mol. Mass.:
436.4572
SMILES:
NC(=O)c1cccc2[nH]c3c(ncnc3c12)N1CCN(CCc2ccc(F)c(F)c2)CC1
: