Target
ATP-dependent translocase ABCB1
Ligand
BDBM50140870
Substrate
Meas. Tech.
ChEMBL_148009 (CHEMBL751606)
IC50
1020±n/a nM
Citation
 Wang, SWan, NCHarrison, JMiller, WChuckowree, ISohal, SHancox, TCBaker, SFolkes, AWilson, FThompson, DCocks, SFarmer, HBoyce, AFreathy, CBroadbridge, JScott, JDepledge, PFaint, RMistry, PCharlton, P Design and synthesis of new templates derived from pyrrolopyrimidine as selective multidrug-resistance-associated protein inhibitors in multidrug resistance. J Med Chem 47:1339-50 (2004)  
Target
Name:
ATP-dependent translocase ABCB1
Synonyms:
Abcb1a MDR1A_MOUSE Mdr3 P-glycoprotein 1 and 3 (MDR1a/MDR1b) Pgy-3 | Pgy3
Type:
Protein
Mol. Mass.:
140669.02
Organism:
Mus musculus (Mouse)
Description:
P21447
Residue:
1276
  
Inhibitor
Name:
BDBM50140870
Synonyms:
(4-{4-[2-(3,4-Difluoro-phenyl)-ethyl]-piperazin-1-yl}-8-nitro-pyrimido[5,4-b]indol-5-yl)-acetic acid ethyl ester | CHEMBL26039
Type:
Small organic molecule
Emp. Form.:
C26H26F2N6O4
Mol. Mass.:
524.5192
SMILES:
CCOC(=O)Cn1c2ccc(cc2c2ncnc(N3CCN(CCc4ccc(F)c(F)c4)CC3)c12)[N+]([O-])=O
: