Target
Nitric oxide synthase, brain
Ligand
BDBM50141086
Substrate
Meas. Tech.
ChEMBL_143351 (CHEMBL750652)
IC50
50.6±n/a nM
Citation
 Lowe, JAQian, WDrozda, SEVolkmann, RANason, DNelson, RBNolan, CListon, DWard, KFaraci, SVerdries, KSeymour, PMajchrzak, MVillalobos, AWhite, WF Structure-activity relationships of potent, selective inhibitors of neuronal nitric oxide synthase based on the 6-phenyl-2-aminopyridine structure. J Med Chem 47:1575-86 (2004)  
Target
Name:
Nitric oxide synthase, brain
Synonyms:
Constitutive NOS NC-NOS NOS type I nNOS NOS1_HUMAN Neuronal nitric oxide synthase Nitric oxide synthase, neuronal (nNOS) bNOS | nNOS
Type:
Homodimer
Mol. Mass.:
160985.98
Organism:
Homo sapiens (Human)
Description:
P29475
Residue:
1434
  
Inhibitor
Name:
BDBM50141086
Synonyms:
6-[7-(2-Dimethylamino-ethoxy)-indan-4-yl]-pyridin-2-ylamine | CHEMBL43678
Type:
Small organic molecule
Emp. Form.:
C18H23N3O
Mol. Mass.:
297.3947
SMILES:
CN(C)CCOc1ccc(c2CCCc12)-c1cccc(N)n1
: