Target
Nitric oxide synthase, brain
Ligand
BDBM50141082
Substrate
Meas. Tech.
ChEMBL_143508 (CHEMBL755122)
IC50
34±n/a nM
Citation
 Lowe, JAQian, WDrozda, SEVolkmann, RANason, DNelson, RBNolan, CListon, DWard, KFaraci, SVerdries, KSeymour, PMajchrzak, MVillalobos, AWhite, WF Structure-activity relationships of potent, selective inhibitors of neuronal nitric oxide synthase based on the 6-phenyl-2-aminopyridine structure. J Med Chem 47:1575-86 (2004)  
Target
Name:
Nitric oxide synthase, brain
Synonyms:
Bnos NC-NOS NOS type I nNOS Neuronal nitric oxide synthase Nitric Oxide Synthase, brain Nitric oxide synthase, brain (nNOS) Nitric-oxide synthase, brain (nNOS) Nos1 | Peptidyl-cysteine S-nitrosylase NOS1
Type:
Enzyme
Mol. Mass.:
160570.98
Organism:
Rattus norvegicus (rat)
Description:
Recombinant nNOS overexpressed in E. coli was used in enzyme assays.
Residue:
1429
  
Inhibitor
Name:
BDBM50141082
Synonyms:
6-[4-(2-Dimethylamino-ethoxy)-5,6,7,8-tetrahydro-naphthalen-1-yl]-pyridin-2-ylamine | CHEMBL43815
Type:
Small organic molecule
Emp. Form.:
C19H25N3O
Mol. Mass.:
311.4213
SMILES:
CN(C)CCOc1ccc(-c2cccc(N)n2)c2CCCCc12
: