Target
1-acyl-sn-glycerol-3-phosphate acyltransferase beta
Ligand
BDBM50141281
Substrate
Meas. Tech.
ChEBML_100169
IC50
100±n/a nM
Citation
 Gong, BHong, FKohm, CBonham, LKlein, P Synthesis and SAR of 2-arylbenzoxazoles, benzothiazoles and benzimidazoles as inhibitors of lysophosphatidic acid acyltransferase-beta. Bioorg Med Chem Lett 14:1455-9 (2004)  
Target
Name:
1-acyl-sn-glycerol-3-phosphate acyltransferase beta
Synonyms:
1-acylglycerol-3-phosphate O-acyltransferase beta PLCB_HUMAN
Type:
PROTEIN
Mol. Mass.:
30924.09
Organism:
Homo sapiens (Human)
Description:
ChEMBL_321473
Residue:
278
  
Inhibitor
Name:
BDBM50141281
Synonyms:
CHEMBL35006 | N-[4-Chloro-3-(5-methyl-benzooxazol-2-yl)-phenyl]-2-cyano-acetamide
Type:
Small organic molecule
Emp. Form.:
C17H12ClN3O2
Mol. Mass.:
325.749
SMILES:
Cc1ccc2oc(nc2c1)-c1cc(NC(=O)CC#N)ccc1Cl
: