Target
1-acyl-sn-glycerol-3-phosphate acyltransferase beta
Ligand
BDBM50141295
Substrate
Meas. Tech.
ChEBML_100169
IC50
550±n/a nM
Citation
 Gong, BHong, FKohm, CBonham, LKlein, P Synthesis and SAR of 2-arylbenzoxazoles, benzothiazoles and benzimidazoles as inhibitors of lysophosphatidic acid acyltransferase-beta. Bioorg Med Chem Lett 14:1455-9 (2004)  
Target
Name:
1-acyl-sn-glycerol-3-phosphate acyltransferase beta
Synonyms:
1-acylglycerol-3-phosphate O-acyltransferase beta PLCB_HUMAN
Type:
PROTEIN
Mol. Mass.:
30924.09
Organism:
Homo sapiens (Human)
Description:
ChEMBL_321473
Residue:
278
  
Inhibitor
Name:
BDBM50141295
Synonyms:
CHEMBL286185 | [3-(5-Chloro-benzooxazol-2-yl)-4-methyl-phenyl]-carbamic acid methyl ester
Type:
Small organic molecule
Emp. Form.:
C16H13ClN2O3
Mol. Mass.:
316.739
SMILES:
COC(=O)Nc1ccc(C)c(c1)-c1nc2cc(Cl)ccc2o1
: