Target
Integrin alpha-IIb/beta-3
Ligand
BDBM50141323
Substrate
Meas. Tech.
ChEMBL_215972 (CHEMBL821001)
IC50
533±n/a nM
Citation
 Penning, TDRussell, MAChen, BBChen, HYDesai, BNDocter, SHEdwards, DJGesicki, GJLiang, CDMalecha, JWYu, SSEngleman, VWFreeman, SKHanneke, MLShannon, KEWestlin, MMNickols, GA Synthesis of cinnamic acids and related isosteres as potent and selective alpha v beta 3 receptor antagonists. Bioorg Med Chem Lett 14:1471-6 (2004)  
Target
Name:
Integrin alpha-IIb/beta-3
Synonyms:
Glycoprotein IIb/IIIa
Type:
Mol. Mass.:
Description:
ASSAY_ID of EBI is 30109
Components:
This complex has 2 components.
Component 1
Name:
Integrin beta-3
Synonyms:
CD_antigen=CD61 GPIIIa ITGB3 Platelet membrane glycoprotein IIIa
Type:
Protein
Mol. Mass.:
87038.91
Organism:
Homo sapiens (Human)
Description:
P05106
Residue:
788
  
Component 2
Name:
Integrin alpha-IIb
Synonyms:
CD_antigen=CD41 GPIIb Glycoprotein IIb ITGA2B Integrin alpha-IIb heavy chain Integrin alpha-IIb light chain, form 2 Integrin alpha-V/beta-3 and alpha-IIb/beta 3 | Platelet membrane glycoprotein IIb
Type:
Protein
Mol. Mass.:
113354.85
Organism:
Homo sapiens (Human)
Description:
P08514
Residue:
1039
  
Inhibitor
Name:
BDBM50141323
Synonyms:
2-[4-(3-Guanidino-benzoylamino)-phenyl]-cyclopropanecarboxylic acid | CHEMBL37600
Type:
Small organic molecule
Emp. Form.:
C18H18N4O3
Mol. Mass.:
338.3605
SMILES:
[#7]\[#6](-[#7])=[#7]/c1cccc(c1)-[#6](=O)-[#7]-c1ccc(cc1)-[#6]-1-[#6]-[#6]-1-[#6](-[#8])=O
: