Target
Integrin alpha-V/beta-3
Ligand
BDBM50141323
Substrate
Meas. Tech.
ChEMBL_32653 (CHEMBL642148)
IC50
65±n/a nM
Citation
 Penning, TDRussell, MAChen, BBChen, HYDesai, BNDocter, SHEdwards, DJGesicki, GJLiang, CDMalecha, JWYu, SSEngleman, VWFreeman, SKHanneke, MLShannon, KEWestlin, MMNickols, GA Synthesis of cinnamic acids and related isosteres as potent and selective alpha v beta 3 receptor antagonists. Bioorg Med Chem Lett 14:1471-6 (2004)  
Target
Name:
Integrin alpha-V/beta-3
Synonyms:
ITGAV/ITGB3 | Integrin beta-3/Vitronectin receptor alpha
Type:
Enzyme
Mol. Mass.:
Description:
Components:
This complex has 2 components.
Component 1
Name:
Integrin alpha-V
Synonyms:
ITAV_HUMAN Integrin alpha-V/alpha-5 VNRA Vitronectin receptor | Vitronectin receptor subunit alpha
Type:
PROTEIN
Mol. Mass.:
116024.92
Organism:
Homo sapiens (Human)
Description:
ChEMBL_582336
Residue:
1048
  
Component 2
Name:
Integrin beta-3
Synonyms:
CD_antigen=CD61 GPIIIa ITGB3 Platelet membrane glycoprotein IIIa
Type:
Protein
Mol. Mass.:
87038.91
Organism:
Homo sapiens (Human)
Description:
P05106
Residue:
788
  
Inhibitor
Name:
BDBM50141323
Synonyms:
2-[4-(3-Guanidino-benzoylamino)-phenyl]-cyclopropanecarboxylic acid | CHEMBL37600
Type:
Small organic molecule
Emp. Form.:
C18H18N4O3
Mol. Mass.:
338.3605
SMILES:
[#7]\[#6](-[#7])=[#7]/c1cccc(c1)-[#6](=O)-[#7]-c1ccc(cc1)-[#6]-1-[#6]-[#6]-1-[#6](-[#8])=O
: