Target
Integrin alpha-V/beta-1
Ligand
BDBM50141313
Substrate
Meas. Tech.
ChEMBL_32649 (CHEMBL642144)
IC50
18±n/a nM
Citation
 Penning, TDRussell, MAChen, BBChen, HYDesai, BNDocter, SHEdwards, DJGesicki, GJLiang, CDMalecha, JWYu, SSEngleman, VWFreeman, SKHanneke, MLShannon, KEWestlin, MMNickols, GA Synthesis of cinnamic acids and related isosteres as potent and selective alpha v beta 3 receptor antagonists. Bioorg Med Chem Lett 14:1471-6 (2004)  
Target
Name:
Integrin alpha-V/beta-1
Synonyms:
Fibronectin receptor beta/Vitronectin receptor alpha Integrin alpha-V/beta-1
Type:
Enzyme
Mol. Mass.:
Description:
Components:
This complex has 2 components.
Component 1
Name:
Integrin alpha-V
Synonyms:
ITAV_HUMAN Integrin alpha-V/alpha-5 VNRA Vitronectin receptor | Vitronectin receptor subunit alpha
Type:
PROTEIN
Mol. Mass.:
116024.92
Organism:
Homo sapiens (Human)
Description:
ChEMBL_582336
Residue:
1048
  
Component 2
Name:
Integrin beta-1
Synonyms:
CD_antigen=CD29 Fibronectin receptor beta GPIIA ITGB1 MDF2 | MSK12
Type:
Enzyme
Mol. Mass.:
88400.38
Organism:
Homo sapiens (Human)
Description:
P05556
Residue:
798
  
Inhibitor
Name:
BDBM50141313
Synonyms:
2-Isopropoxycarbonylamino-3-{4-[3-(5-oxo-4,5-dihydro-1H-imidazol-2-ylamino)-benzoylamino]-phenyl}-propionic acid | CHEMBL37674
Type:
Small organic molecule
Emp. Form.:
C23H25N5O6
Mol. Mass.:
467.4745
SMILES:
CC(C)OC(=O)NC(Cc1ccc(NC(=O)c2cccc(Nc3nc(O)c[nH]3)c2)cc1)C(O)=O
: