Target
Dual specificity mitogen-activated protein kinase kinase 1
Ligand
BDBM50141409
Substrate
Meas. Tech.
ChEBML_124012
IC50
55±n/a nM
Citation
 Wityak, JHobbs, FWGardner, DSSantella, JBPetraitis, JJSun, JHFavata, MFDaulerio, AJHoriuchi, KYCopeland, RAScherle, PAJaffe, BDTrzaskos, JMMagolda, RLTrainor, GLDuncia, JV Beyond U0126. Dianion chemistry leading to the rapid synthesis of a series of potent MEK inhibitors. Bioorg Med Chem Lett 14:1483-6 (2004)  
Target
Name:
Dual specificity mitogen-activated protein kinase kinase 1
Synonyms:
Dual specificity mitogen-activated protein kinase (MEK) Dual specificity mitogen-activated protein kinase kinase 1 (MEK1) Dual specificity mitogen-activated protein kinase kinase MEK1/2 MAP kinase kinase 1 MAPK/ERK kinase 1 MEK-1 MP2K1_HUMAN PRKMK1 | VHL-MAP2K1/MAP2K2
Type:
Other Protein Type
Mol. Mass.:
43439.03
Organism:
Homo sapiens (Human)
Description:
Full-length human MEK-1 was generated by PCR and purified as a fusion protein from Escherichia coli lysates.
Residue:
393
  
Inhibitor
Name:
BDBM50141409
Synonyms:
(Z)-3-Amino-3-(2-amino-phenylsulfanyl)-2-[3-(furan-3-yl-hydroxy-methyl)-phenyl]-acrylonitrile | CHEMBL290886
Type:
Small organic molecule
Emp. Form.:
C20H17N3O2S
Mol. Mass.:
363.433
SMILES:
Nc1ccccc1SC(=N)C(C#N)c1cccc(c1)C(O)c1ccoc1
: