Target
Tumor necrosis factor receptor superfamily member 1A
Ligand
BDBM50141482
Substrate
Meas. Tech.
ChEBML_224214
IC50
3000±n/a nM
Citation
 Meng, CQZheng, XSNi, LYe, ZSimpson, JEWorsencroft, KJHotema, MRWeingarten, MDSkudlarek, JWGilmore, JMHoong, LKHill, RRMarino, EMSuen, KLKunsch, CWasserman, MASikorski, JA Discovery of novel heteroaryl-substituted chalcones as inhibitors of TNF-alpha-induced VCAM-1 expression. Bioorg Med Chem Lett 14:1513-7 (2004)  
Target
Name:
Tumor necrosis factor receptor superfamily member 1A
Synonyms:
CD_antigen=CD120a TNF-R1 TNFAR TNFR1 TNR1A_HUMAN Tumor necrosis factor receptor superfamily member 1A Tumor necrosis factor-binding protein 1 p60
Type:
PROTEIN
Mol. Mass.:
50495.39
Organism:
Homo sapiens (Human)
Description:
ChEMBL_1509419
Residue:
455
  
Inhibitor
Name:
BDBM50141482
Synonyms:
(E)-1-[3,5-Dimethoxy-4-(thiophen-2-ylmethoxy)-phenyl]-3-(3,4,5-trimethoxy-phenyl)-propenone | CHEMBL39783
Type:
Small organic molecule
Emp. Form.:
C25H26O7S
Mol. Mass.:
470.535
SMILES:
COc1cc(\C=C\C(=O)c2cc(OC)c(OCc3cccs3)c(OC)c2)cc(OC)c1OC
: