Target
Tumor necrosis factor receptor superfamily member 1A
Ligand
BDBM50141501
Substrate
Meas. Tech.
ChEBML_224214
IC50
4000±n/a nM
Citation
 Meng, CQZheng, XSNi, LYe, ZSimpson, JEWorsencroft, KJHotema, MRWeingarten, MDSkudlarek, JWGilmore, JMHoong, LKHill, RRMarino, EMSuen, KLKunsch, CWasserman, MASikorski, JA Discovery of novel heteroaryl-substituted chalcones as inhibitors of TNF-alpha-induced VCAM-1 expression. Bioorg Med Chem Lett 14:1513-7 (2004)  
Target
Name:
Tumor necrosis factor receptor superfamily member 1A
Synonyms:
CD_antigen=CD120a TNF-R1 TNFAR TNFR1 TNR1A_HUMAN Tumor necrosis factor receptor superfamily member 1A Tumor necrosis factor-binding protein 1 p60
Type:
PROTEIN
Mol. Mass.:
50495.39
Organism:
Homo sapiens (Human)
Description:
ChEMBL_1509419
Residue:
455
  
Inhibitor
Name:
BDBM50141501
Synonyms:
(E)-3-(3-Bromo-4,5-dimethoxy-phenyl)-1-(3,4,5-trimethoxy-phenyl)-propenone | CHEMBL33897
Type:
Small organic molecule
Emp. Form.:
C20H21BrO6
Mol. Mass.:
437.281
SMILES:
COc1cc(\C=C\C(=O)c2cc(OC)c(OC)c(OC)c2)cc(Br)c1OC
: