Target
Tumor necrosis factor receptor superfamily member 1A
Ligand
BDBM50141540
Substrate
Meas. Tech.
ChEBML_224214
IC50
3000±n/a nM
Citation
 Meng, CQZheng, XSNi, LYe, ZSimpson, JEWorsencroft, KJHotema, MRWeingarten, MDSkudlarek, JWGilmore, JMHoong, LKHill, RRMarino, EMSuen, KLKunsch, CWasserman, MASikorski, JA Discovery of novel heteroaryl-substituted chalcones as inhibitors of TNF-alpha-induced VCAM-1 expression. Bioorg Med Chem Lett 14:1513-7 (2004)  
Target
Name:
Tumor necrosis factor receptor superfamily member 1A
Synonyms:
CD_antigen=CD120a TNF-R1 TNFAR TNFR1 TNR1A_HUMAN Tumor necrosis factor receptor superfamily member 1A Tumor necrosis factor-binding protein 1 p60
Type:
PROTEIN
Mol. Mass.:
50495.39
Organism:
Homo sapiens (Human)
Description:
ChEMBL_1509419
Residue:
455
  
Inhibitor
Name:
BDBM50141540
Synonyms:
(E)-3-(2-Methoxy-5-thiophen-2-yl-phenyl)-1-(2,4,6-trimethoxy-phenyl)-propenone | CHEMBL35697
Type:
Small organic molecule
Emp. Form.:
C23H22O5S
Mol. Mass.:
410.483
SMILES:
COc1cc(OC)c(C(=O)\C=C\c2cc(ccc2OC)-c2cccs2)c(OC)c1
: