Target
Tumor necrosis factor receptor superfamily member 1A
Ligand
BDBM50141546
Substrate
Meas. Tech.
ChEBML_224214
IC50
4000±n/a nM
Citation
 Meng, CQZheng, XSNi, LYe, ZSimpson, JEWorsencroft, KJHotema, MRWeingarten, MDSkudlarek, JWGilmore, JMHoong, LKHill, RRMarino, EMSuen, KLKunsch, CWasserman, MASikorski, JA Discovery of novel heteroaryl-substituted chalcones as inhibitors of TNF-alpha-induced VCAM-1 expression. Bioorg Med Chem Lett 14:1513-7 (2004)  
Target
Name:
Tumor necrosis factor receptor superfamily member 1A
Synonyms:
CD_antigen=CD120a TNF-R1 TNFAR TNFR1 TNR1A_HUMAN Tumor necrosis factor receptor superfamily member 1A Tumor necrosis factor-binding protein 1 p60
Type:
PROTEIN
Mol. Mass.:
50495.39
Organism:
Homo sapiens (Human)
Description:
ChEMBL_1509419
Residue:
455
  
Inhibitor
Name:
BDBM50141546
Synonyms:
(E)-1-Benzo[1,3]dioxol-5-yl-3-[2-methoxy-5-(4-methyl-thiophen-2-yl)-phenyl]-propenone | CHEMBL39558
Type:
Small organic molecule
Emp. Form.:
C22H18O4S
Mol. Mass.:
378.441
SMILES:
COc1ccc(cc1\C=C\C(=O)c1ccc2OCOc2c1)-c1cc(C)cs1
: