Target
cGMP-dependent 3',5'-cyclic phosphodiesterase
Ligand
BDBM50141581
Substrate
Meas. Tech.
ChEBML_156336
IC50
>50000±n/a nM
Citation
 Bi, YStoy, PAdam, LHe, BKrupinski, JNormandin, DPongrac, RSeliger, LWatson, AMacor, JE Quinolines as extremely potent and selective PDE5 inhibitors as potential agents for treatment of erectile dysfunction. Bioorg Med Chem Lett 14:1577-80 (2004)  
Target
Name:
cGMP-dependent 3',5'-cyclic phosphodiesterase
Synonyms:
CGS-PDE Homo sapiens phosphodiesterase 2A (PDE2A) PDE2A cGSPDE
Type:
Enzyme Catalytic Domain
Mol. Mass.:
105691.58
Organism:
Homo sapiens (Human)
Description:
O00408
Residue:
941
  
Inhibitor
Name:
BDBM50141581
Synonyms:
4-(3-Chloro-4-methoxy-benzylamino)-7-trifluoromethyl-quinoline-3-carboxylic acid ethyl ester | CHEMBL41950
Type:
Small organic molecule
Emp. Form.:
C21H18ClF3N2O3
Mol. Mass.:
438.827
SMILES:
CCOC(=O)c1cnc2cc(ccc2c1NCc1ccc(OC)c(Cl)c1)C(F)(F)F
: