Target
Retinoic acid receptor RXR-gamma
Ligand
BDBM50452047
Substrate
Meas. Tech.
ChEBML_196463
Ki
29±n/a nM
Citation
 Michellys, PYD'Arrigo, JGrese, TAKaranewsky, DSLeibowitz, MDMais, DAMapes, CMReifel-Miller, ARungta, DBoehm, MF Design, synthesis and structure-activity relationship of novel RXR-selective modulators. Bioorg Med Chem Lett 14:1593-8 (2004)  
Target
Name:
Retinoic acid receptor RXR-gamma
Synonyms:
NR2B3 RXRG Retinoic acid receptor RXR-gamma Retinoid X receptor gamma/retinoic acid receptor alpha
Type:
PROTEIN
Mol. Mass.:
50878.26
Organism:
Homo sapiens (Human)
Description:
ChEMBL_197216
Residue:
463
  
Inhibitor
Name:
BDBM50452047
Synonyms:
CHEMBL2372524
Type:
Small organic molecule
Emp. Form.:
C14H21N4O6P
Mol. Mass.:
372.3135
SMILES:
C[C@H](NC(=O)[C@H](Cc1ccccc1)NP(O)(O)=O)C(=O)NCC(N)=O
: