Target
Retinoic acid receptor RXR-alpha
Ligand
BDBM50452047
Substrate
Meas. Tech.
ChEMBL_196594 (CHEMBL800472)
EC50
86±n/a nM
Citation
 Michellys, PYD'Arrigo, JGrese, TAKaranewsky, DSLeibowitz, MDMais, DAMapes, CMReifel-Miller, ARungta, DBoehm, MF Design, synthesis and structure-activity relationship of novel RXR-selective modulators. Bioorg Med Chem Lett 14:1593-8 (2004)  
Target
Name:
Retinoic acid receptor RXR-alpha
Synonyms:
NR2B1 Nuclear receptor subfamily 4 group A member 2 RXRA Retinoic acid receptor RXR-alpha/gamma Retinoid receptor
Type:
PROTEIN
Mol. Mass.:
50820.38
Organism:
Homo sapiens (Human)
Description:
ChEMBL_1456363
Residue:
462
  
Inhibitor
Name:
BDBM50452047
Synonyms:
CHEMBL2372524
Type:
Small organic molecule
Emp. Form.:
C14H21N4O6P
Mol. Mass.:
372.3135
SMILES:
C[C@H](NC(=O)[C@H](Cc1ccccc1)NP(O)(O)=O)C(=O)NCC(N)=O
: