Target
Retinoic acid receptor alpha
Ligand
BDBM50141595
Substrate
Meas. Tech.
ChEBML_196468
Ki
7280±n/a nM
Citation
 Michellys, PYD'Arrigo, JGrese, TAKaranewsky, DSLeibowitz, MDMais, DAMapes, CMReifel-Miller, ARungta, DBoehm, MF Design, synthesis and structure-activity relationship of novel RXR-selective modulators. Bioorg Med Chem Lett 14:1593-8 (2004)  
Target
Name:
Retinoic acid receptor alpha
Synonyms:
NR1B1 RAR-alpha RARA_HUMAN Retinoic acid receptor alpha/Retinoid X receptor alpha Retinoid receptor
Type:
PROTEIN
Mol. Mass.:
50778.87
Organism:
Homo sapiens (Human)
Description:
ChEMBL_1466191
Residue:
462
  
Inhibitor
Name:
BDBM50141595
Synonyms:
(E)-3-{4-[3,5-Di-tert-butyl-2-(3-fluoro-propoxy)-phenyl]-benzo[b]thiophen-2-yl}-but-2-enoic acid | CHEMBL41146
Type:
Small organic molecule
Emp. Form.:
C29H35FO3S
Mol. Mass.:
482.65
SMILES:
C\C(=C/C(O)=O)c1cc2c(cccc2s1)-c1cc(cc(c1OCCCF)C(C)(C)C)C(C)(C)C
: