Target
Retinoic acid receptor RXR-beta
Ligand
BDBM50141590
Substrate
Meas. Tech.
ChEBML_197088
Ki
11±n/a nM
Citation
 Michellys, PYD'Arrigo, JGrese, TAKaranewsky, DSLeibowitz, MDMais, DAMapes, CMReifel-Miller, ARungta, DBoehm, MF Design, synthesis and structure-activity relationship of novel RXR-selective modulators. Bioorg Med Chem Lett 14:1593-8 (2004)  
Target
Name:
Retinoic acid receptor RXR-beta
Synonyms:
NR2B2 RXRB Retinoic acid receptor RXR-beta Retinoid receptor
Type:
PROTEIN
Mol. Mass.:
56932.89
Organism:
Homo sapiens (Human)
Description:
ChEMBL_39045
Residue:
533
  
Inhibitor
Name:
BDBM50141590
Synonyms:
(E)-3-[4-(2-Ethoxy-3,5-diisopropyl-phenyl)-benzo[b]thiophen-2-yl]-but-2-enoic acid | CHEMBL41890
Type:
Small organic molecule
Emp. Form.:
C26H30O3S
Mol. Mass.:
422.58
SMILES:
CCOc1c(cc(cc1-c1cccc2sc(cc12)C(\C)=C\C(O)=O)C(C)C)C(C)C
: