Target
RNA-directed RNA polymerase
Ligand
BDBM50142044
Substrate
Meas. Tech.
ChEBML_143775
IC50
100±n/a nM
Citation
 Beaulieu, PLBös, MBousquet, YDeRoy, PFazal, GGauthier, JGillard, JGoulet, SMcKercher, GPoupart, MAValois, SKukolj, G Non-nucleoside inhibitors of the hepatitis C virus NS5B polymerase: discovery of benzimidazole 5-carboxylic amide derivatives with low-nanomolar potency. Bioorg Med Chem Lett 14:967-71 (2004)  
Target
Name:
RNA-directed RNA polymerase
Synonyms:
Hepatitis C virus NS5B RNA-dependent RNA polymerase | NS5B protein
Type:
Protein
Mol. Mass.:
25173.95
Organism:
Hepatitis C virus
Description:
Q8JXU8
Residue:
229
  
Inhibitor
Name:
BDBM50142044
Synonyms:
(S)-3-[5-(1-Carboxy-1-methyl-ethoxy)-1H-indol-3-yl]-2-[(1-cyclohexyl-2-furan-3-yl-1H-benzoimidazole-5-carbonyl)-amino]-propionic acid | CHEMBL369000
Type:
Small organic molecule
Emp. Form.:
C33H34N4O7
Mol. Mass.:
598.6457
SMILES:
CC(C)(Oc1ccc2[nH]cc(C[C@H](NC(=O)c3ccc4n(C5CCCCC5)c(nc4c3)-c3ccoc3)C(O)=O)c2c1)C(O)=O
: