Target
DNA-directed RNA polymerase subunit beta
Ligand
BDBM50142052
Substrate
Meas. Tech.
ChEMBL_164128 (CHEMBL768020)
IC50
>200000±n/a nM
Citation
 Beaulieu, PLBös, MBousquet, YDeRoy, PFazal, GGauthier, JGillard, JGoulet, SMcKercher, GPoupart, MAValois, SKukolj, G Non-nucleoside inhibitors of the hepatitis C virus NS5B polymerase: discovery of benzimidazole 5-carboxylic amide derivatives with low-nanomolar potency. Bioorg Med Chem Lett 14:967-71 (2004)  
Target
Name:
DNA-directed RNA polymerase subunit beta
Synonyms:
Bacterial DNA-directed RNA polymerase DNA-directed RNA polymerase subunit beta RNA polymerase subunit beta (β-RNAP) RPOB_ECOLI groN rif rpoB stv | tabD
Type:
Enzyme
Mol. Mass.:
150595.80
Organism:
Escherichia coli
Description:
P0A8V2
Residue:
1342
  
Inhibitor
Name:
BDBM50142052
Synonyms:
(2S)-2-(1-cyclohexyl-2-(furan-3-yl)-1H-benzo[d]imidazole-5-carboxamido)-3-(5-hydroxy-1H-indol-3-yl)propanoic acid (S)-2-[(1-Cyclohexyl-2-furan-3-yl-1H-benzoimidazole-5-carbonyl)-amino]-3-(5-hydroxy-1H-indol-3-yl)-propionic acid | CHEMBL367225
Type:
Small organic molecule
Emp. Form.:
C29H28N4O5
Mol. Mass.:
512.5564
SMILES:
OC(=O)[C@H](Cc1c[nH]c2ccc(O)cc12)NC(=O)c1ccc2n(C3CCCCC3)c(nc2c1)-c1ccoc1
: