Target
DNA-directed RNA polymerase subunit beta
Ligand
BDBM50142049
Substrate
Meas. Tech.
ChEBML_164132
IC50
>500000±n/a nM
Citation
 Beaulieu, PLBös, MBousquet, YDeRoy, PFazal, GGauthier, JGillard, JGoulet, SMcKercher, GPoupart, MAValois, SKukolj, G Non-nucleoside inhibitors of the hepatitis C virus NS5B polymerase: discovery of benzimidazole 5-carboxylic amide derivatives with low-nanomolar potency. Bioorg Med Chem Lett 14:967-71 (2004)  
Target
Name:
DNA-directed RNA polymerase subunit beta
Synonyms:
Bacterial DNA-directed RNA polymerase DNA-directed RNA polymerase subunit beta RNA polymerase subunit beta (β-RNAP) RPOB_ECOLI groN rif rpoB stv | tabD
Type:
Enzyme
Mol. Mass.:
150595.80
Organism:
Escherichia coli
Description:
P0A8V2
Residue:
1342
  
Inhibitor
Name:
BDBM50142049
Synonyms:
(S)-2-[(1-Cyclohexyl-2-furan-3-yl-1H-benzoimidazole-5-carbonyl)-amino]-3-(5-methanesulfonylamino-1H-indol-3-yl)-propionic acid | CHEMBL177073
Type:
Small organic molecule
Emp. Form.:
C30H31N5O6S
Mol. Mass.:
589.662
SMILES:
CS(=O)(=O)Nc1ccc2[nH]cc(C[C@H](NC(=O)c3ccc4n(C5CCCCC5)c(nc4c3)-c3ccoc3)C(O)=O)c2c1
: