Target
Coagulation factor X
Ligand
BDBM50142097
Substrate
Meas. Tech.
ChEBML_49138
IC50
66±n/a nM
Citation
 Zhang, PBao, LZuckett, JFGoldman, EAJia, ZJArfsten, AEdwards, SSinha, UHutchaleelaha, APark, GLambing, JLHollenbach, SJScarborough, RMZhu, BY Design, synthesis, and SAR of anthranilamide-based factor Xa inhibitors incorporating substituted biphenyl P4 motifs. Bioorg Med Chem Lett 14:983-7 (2004)  
Target
Name:
Coagulation factor X
Synonyms:
Activated coagulation factor X (FXa) Coagulation factor X precursor F10 Factor X heavy chain Factor Xa Stuart-Prower factor
Type:
Enzyme
Mol. Mass.:
54726.60
Organism:
Homo sapiens (Human)
Description:
Residue:
488
  
Inhibitor
Name:
BDBM50142097
Synonyms:
4'-Carbamimidoyl-biphenyl-4-carboxylic acid [4-chloro-2-(5-chloro-pyridin-2-ylcarbamoyl)-phenyl]-amide | CHEMBL175141
Type:
Small organic molecule
Emp. Form.:
C26H19Cl2N5O2
Mol. Mass.:
504.367
SMILES:
NC(=N)c1ccc(cc1)-c1ccc(cc1)C(=O)Nc1ccc(Cl)cc1C(=O)Nc1ccc(Cl)cn1
: