Target
Coagulation factor X
Ligand
BDBM50142163
Substrate
Meas. Tech.
ChEBML_48817
IC50
0.200000±n/a nM
Citation
 Zhang, PBao, LZuckett, JFJia, ZJWoolfrey, JArfsten, AEdwards, SSinha, UHutchaleelaha, ALambing, JLHollenbach, SJScarborough, RMZhu, BY Design, synthesis, and SAR of anthranilamide-based factor Xa inhibitors with improved functional activity. Bioorg Med Chem Lett 14:989-93 (2004)  
Target
Name:
Coagulation factor X
Synonyms:
Activated coagulation factor X (FXa) Coagulation factor X precursor F10 Factor X heavy chain Factor Xa Stuart-Prower factor
Type:
Enzyme
Mol. Mass.:
54726.60
Organism:
Homo sapiens (Human)
Description:
Residue:
488
  
Inhibitor
Name:
BDBM50142163
Synonyms:
5-Chloro-N-(5-chloro-pyridin-2-yl)-2-[4-(2-imino-oxazolidin-3-ylmethyl)-benzoylamino]-benzamide CHEMBL367953
Type:
Small organic molecule
Emp. Form.:
C23H19Cl2N5O3
Mol. Mass.:
484.335
SMILES:
Clc1ccc(NC(=O)c2cc(Cl)ccc2NC(=O)c2ccc(CN3CCOC3=N)cc2)nc1
: