Target
Coagulation factor X
Ligand
BDBM50142171
Substrate
Meas. Tech.
ChEBML_48817
IC50
171±n/a nM
Citation
 Zhang, PBao, LZuckett, JFJia, ZJWoolfrey, JArfsten, AEdwards, SSinha, UHutchaleelaha, ALambing, JLHollenbach, SJScarborough, RMZhu, BY Design, synthesis, and SAR of anthranilamide-based factor Xa inhibitors with improved functional activity. Bioorg Med Chem Lett 14:989-93 (2004)  
Target
Name:
Coagulation factor X
Synonyms:
Activated coagulation factor X (FXa) Coagulation factor X precursor F10 Factor X heavy chain Factor Xa Stuart-Prower factor
Type:
Enzyme
Mol. Mass.:
54726.60
Organism:
Homo sapiens (Human)
Description:
Residue:
488
  
Inhibitor
Name:
BDBM50142171
Synonyms:
1-{4-[4-Chloro-2-(5-chloro-pyridin-2-ylcarbamoyl)-phenylcarbamoyl]-benzyl}-piperidine-4-carboxylic acid ethyl ester | CHEMBL366647
Type:
Small organic molecule
Emp. Form.:
C28H28Cl2N4O4
Mol. Mass.:
555.452
SMILES:
CCOC(=O)C1CCN(Cc2ccc(cc2)C(=O)Nc2ccc(Cl)cc2C(=O)Nc2ccc(Cl)cn2)CC1
: