Target
Coagulation factor X
Ligand
BDBM50142149
Substrate
Meas. Tech.
ChEBML_48817
IC50
40±n/a nM
Citation
 Zhang, PBao, LZuckett, JFJia, ZJWoolfrey, JArfsten, AEdwards, SSinha, UHutchaleelaha, ALambing, JLHollenbach, SJScarborough, RMZhu, BY Design, synthesis, and SAR of anthranilamide-based factor Xa inhibitors with improved functional activity. Bioorg Med Chem Lett 14:989-93 (2004)  
Target
Name:
Coagulation factor X
Synonyms:
Activated coagulation factor X (FXa) Coagulation factor X precursor F10 Factor X heavy chain Factor Xa Stuart-Prower factor
Type:
Enzyme
Mol. Mass.:
54726.60
Organism:
Homo sapiens (Human)
Description:
Residue:
488
  
Inhibitor
Name:
BDBM50142149
Synonyms:
5-Chloro-N-(5-chloro-pyridin-2-yl)-2-(4-hydrazinomethyl-benzoylamino)-benzamide | CHEMBL176736
Type:
Small organic molecule
Emp. Form.:
C20H17Cl2N5O2
Mol. Mass.:
430.287
SMILES:
NNCc1ccc(cc1)C(=O)Nc1ccc(Cl)cc1C(=O)Nc1ccc(Cl)cn1
: