Target
Prothrombin
Ligand
BDBM50142151
Substrate
Meas. Tech.
ChEBML_208119
IC50
>11000±n/a nM
Citation
 Zhang, PBao, LZuckett, JFJia, ZJWoolfrey, JArfsten, AEdwards, SSinha, UHutchaleelaha, ALambing, JLHollenbach, SJScarborough, RMZhu, BY Design, synthesis, and SAR of anthranilamide-based factor Xa inhibitors with improved functional activity. Bioorg Med Chem Lett 14:989-93 (2004)  
Target
Name:
Prothrombin
Synonyms:
Activation peptide fragment 1 Coagulation factor II Prothrombin precursor Thrombin heavy chain | Thrombin light chain
Type:
Protein
Mol. Mass.:
70029.57
Organism:
Homo sapiens (Human)
Description:
P00734
Residue:
622
  
Inhibitor
Name:
BDBM50142151
Synonyms:
5-Chloro-N-(5-chloro-pyridin-2-yl)-2-(4-{[(2-hydroxy-ethyl)-methyl-amino]-methyl}-benzoylamino)-benzamide | CHEMBL176856
Type:
Small organic molecule
Emp. Form.:
C23H22Cl2N4O3
Mol. Mass.:
473.352
SMILES:
CN(CCO)Cc1ccc(cc1)C(=O)Nc1ccc(Cl)cc1C(=O)Nc1ccc(Cl)cn1
: