Target
Plasminogen
Ligand
BDBM50142144
Substrate
Meas. Tech.
ChEBML_155053
IC50
>11000±n/a nM
Citation
 Zhang, PBao, LZuckett, JFJia, ZJWoolfrey, JArfsten, AEdwards, SSinha, UHutchaleelaha, ALambing, JLHollenbach, SJScarborough, RMZhu, BY Design, synthesis, and SAR of anthranilamide-based factor Xa inhibitors with improved functional activity. Bioorg Med Chem Lett 14:989-93 (2004)  
Target
Name:
Plasminogen
Synonyms:
Activation peptide PLG Plasmin Plasmin heavy chain A, short form | Plasmin light chain B
Type:
Enzyme
Mol. Mass.:
90579.18
Organism:
Homo sapiens (Human)
Description:
Residue:
810
  
Inhibitor
Name:
BDBM50142144
Synonyms:
5-Chloro-N-(5-chloro-pyridin-2-yl)-2-{4-[4-(1-imino-ethyl)-piperazin-1-ylmethyl]-benzoylamino}-benzamide | CHEMBL176210
Type:
Small organic molecule
Emp. Form.:
C26H26Cl2N6O2
Mol. Mass.:
525.43
SMILES:
CC(=N)N1CCN(Cc2ccc(cc2)C(=O)Nc2ccc(Cl)cc2C(=O)Nc2ccc(Cl)cn2)CC1
: