Target
ATP synthase subunit beta,/delta,/epsilon,/gamma, mitochondrial
Ligand
BDBM50404309
Substrate
Meas. Tech.
ChEMBL_65924 (CHEMBL679200)
IC50
>30000±n/a nM
Citation
 Hamann, LGDing, CZMiller, AVMadsen, CSWang, PStein, PDPudzianowski, ATGreen, DWMonshizadegan, HAtwal, KS Benzodiazepine-based selective inhibitors of mitochondrial F1F0 ATP hydrolase. Bioorg Med Chem Lett 14:1031-4 (2004)  
Target
Name:
ATP synthase subunit beta,/delta,/epsilon,/gamma, mitochondrial
Synonyms:
Mitochondrial complex V; ATP synthase
Type:
Mol. Mass.:
Description:
ASSAY_ID of EBI is 65924
Components:
This complex has 4 components.
Component 1
Name:
ATP synthase subunit epsilon, mitochondrial
Synonyms:
ATP5E ATP5F1E | ATPase subunit epsilon
Type:
PROTEIN
Mol. Mass.:
5790.87
Organism:
Bos taurus
Description:
EBI_100264
Residue:
51
  
Component 2
Name:
ATP synthase subunit beta, mitochondrial
Synonyms:
ATP5B ATPB_BOVIN
Type:
PROTEIN
Mol. Mass.:
56271.25
Organism:
Bos taurus
Description:
EBI_100264
Residue:
528
  
Component 3
Name:
ATP synthase subunit gamma, mitochondrial
Synonyms:
ATP5C ATP5F1C F-ATPase gamma subunit
Type:
PROTEIN
Mol. Mass.:
33081.70
Organism:
Bos taurus
Description:
ChEMBL_65923
Residue:
298
  
Component 4
Name:
ATP synthase subunit delta, mitochondrial
Synonyms:
ATP5D ATPD_BOVIN | F-ATPase delta subunit
Type:
PROTEIN
Mol. Mass.:
17608.84
Organism:
Bos taurus
Description:
EBI_100264
Residue:
168
  
Inhibitor
Name:
BDBM50404309
Synonyms:
CHEMBL269156
Type:
Small organic molecule
Emp. Form.:
C27H26N6O3S
Mol. Mass.:
514.599
SMILES:
O=S(=O)(N1CC(CCc2ccccc2)N(Cc2cnc[nH]2)c2ccccc2C1)c1cccc2nonc12
: