Target
Tyrosine-protein phosphatase non-receptor type 1
Ligand
BDBM50142313
Substrate
Meas. Tech.
ChEMBL_162580 (CHEMBL768521)
IC50
110±n/a nM
Citation
 Dufresne, CRoy, PWang, ZAsante-Appiah, ECromlish, WBoie, YForghani, FDesmarais, SWang, QSkorey, KWaddleton, DRamachandran, CKennedy, BPXu, LGordon, RChan, CCLeblanc, Y The development of potent non-peptidic PTP-1B inhibitors. Bioorg Med Chem Lett 14:1039-42 (2004)  
Target
Name:
Tyrosine-protein phosphatase non-receptor type 1
Synonyms:
PTN1_HUMAN PTPN1 Protein tyrosine phosphatase-1B (PTP1B) Protein-tyrosine phosphatase 1B (PTP1B) Tyrosine-protein phosphatase non-receptor type 1 (PTP1B)
Type:
Protein phosphatase
Mol. Mass.:
49963.76
Organism:
Homo sapiens (Human)
Description:
Human recombinant GST-fusion PTP1B (1-435).
Residue:
435
  
Inhibitor
Name:
BDBM50142313
Synonyms:
2,2-Bis-[4-(difluoro-phosphono-methyl)-benzyl]-malonic acid diisopropyl ester | CHEMBL8767
Type:
Small organic molecule
Emp. Form.:
C25H30F4O10P2
Mol. Mass.:
628.4408
SMILES:
CC(C)OC(=O)C(Cc1ccc(cc1)C(F)(F)P(O)(O)=O)(Cc1ccc(cc1)C(F)(F)P(O)(O)=O)C(=O)OC(C)C
: