Target
Receptor-type tyrosine-protein phosphatase C
Ligand
BDBM50142329
Substrate
Meas. Tech.
ChEBML_40067
IC50
50000±n/a nM
Citation
 Lau, CKBayly, CIGauthier, JYLi, CSTherien, MAsante-Appiah, ECromlish, WBoie, YForghani, FDesmarais, SWang, QSkorey, KWaddleton, DPayette, PRamachandran, CKennedy, BPScapin, G Structure based design of a series of potent and selective non peptidic PTP-1B inhibitors. Bioorg Med Chem Lett 14:1043-8 (2004)  
Target
Name:
Receptor-type tyrosine-protein phosphatase C
Synonyms:
CD45 L-CA PTPRC Receptor-type tyrosine-protein phosphatase C (CD45) | T200
Type:
Protein
Mol. Mass.:
147474.19
Organism:
Homo sapiens (Human)
Description:
P08575
Residue:
1306
  
Inhibitor
Name:
BDBM50142329
Synonyms:
({4-[2-Benzotriazol-1-yl-3-[4-(difluoro-phosphono-methyl)-phenyl]-2-(4-phenyl-thiazol-2-yl)-propyl]-phenyl}-difluoro-methyl)-phosphonic acid | CHEMBL9473
Type:
Small organic molecule
Emp. Form.:
C32H26F4N4O6P2S
Mol. Mass.:
732.578
SMILES:
OP(O)(=O)C(F)(F)c1ccc(CC(Cc2ccc(cc2)C(F)(F)P(O)(O)=O)(c2nc(cs2)-c2ccccc2)n2nnc3ccccc23)cc1
: