Target
Tyrosine-protein phosphatase non-receptor type 2
Ligand
BDBM50142326
Substrate
Meas. Tech.
ChEBML_207132
IC50
85.0±n/a nM
Citation
 Lau, CKBayly, CIGauthier, JYLi, CSTherien, MAsante-Appiah, ECromlish, WBoie, YForghani, FDesmarais, SWang, QSkorey, KWaddleton, DPayette, PRamachandran, CKennedy, BPScapin, G Structure based design of a series of potent and selective non peptidic PTP-1B inhibitors. Bioorg Med Chem Lett 14:1043-8 (2004)  
Target
Name:
Tyrosine-protein phosphatase non-receptor type 2
Synonyms:
PTN2_HUMAN PTPT T-cell protein-tyrosine phosphatase TCPTP Tyrosine-protein phosphatase non-receptor type 2 (TC-PTP)
Type:
Protein
Mol. Mass.:
48481.80
Organism:
Homo sapiens (Human)
Description:
P17706
Residue:
415
  
Inhibitor
Name:
BDBM50142326
Synonyms:
CHEMBL276648 | [(4-{2-Benzotriazol-1-yl-2-phenyl-1-[2'-(2H-tetrazol-5-yl)-biphenyl-4-yl]-ethyl}-phenyl)-difluoro-methyl]-phosphonic acid
Type:
Small organic molecule
Emp. Form.:
C34H26F2N7O3P
Mol. Mass.:
649.5859
SMILES:
OP(O)(=O)C(F)(F)c1ccc(cc1)C(C(c1ccccc1)n1nnc2ccccc12)c1ccc(cc1)-c1ccccc1-c1nnn[nH]1
: