Target
Prostaglandin G/H synthase 1
Ligand
BDBM50142590
Substrate
Meas. Tech.
ChEBML_159280
IC50
85300±n/a nM
Citation
 Singh, SKVobbalareddy, SShivaramakrishna, SKrishnamraju, ARajjak, SACasturi, SRAkhila, VRao, YK Methanesulfonamide group at position-4 of the C-5-phenyl ring of 1,5-diarylpyrazole affords a potent class of cyclooxygenase-2 (COX-2) inhibitors. Bioorg Med Chem Lett 14:1683-8 (2004)  
Target
Name:
Prostaglandin G/H synthase 1
Synonyms:
COX1 Cyclooxygenase-1 (COX-1) PTGS1 | Prostaglandin G/H synthase (cyclooxygenase)
Type:
Protein
Mol. Mass.:
68868.60
Organism:
Ovis aries (Sheep)
Description:
Residue:
600
  
Inhibitor
Name:
BDBM50142590
Synonyms:
CHEMBL44319 | N-[4-(2-Phenyl-5-trifluoromethyl-2H-pyrazol-3-yl)-phenyl]-methanesulfonamide
Type:
Small organic molecule
Emp. Form.:
C17H14F3N3O2S
Mol. Mass.:
381.372
SMILES:
CS(=O)(=O)Nc1ccc(cc1)-c1cc(nn1-c1ccccc1)C(F)(F)F
: