Target
N-acetylated-alpha-linked acidic dipeptidase 2
Ligand
BDBM50143072
Substrate
Meas. Tech.
ChEMBL_71707 (CHEMBL680921)
Ki
939±n/a nM
Citation
 Kozikowski, APZhang, JNan, FPetukhov, PAGrajkowska, EWroblewski, JTYamamoto, TBzdega, TWroblewska, BNeale, JH Synthesis of urea-based inhibitors as active site probes of glutamate carboxypeptidase II: efficacy as analgesic agents. J Med Chem 47:1729-38 (2004)  
Target
Name:
N-acetylated-alpha-linked acidic dipeptidase 2
Synonyms:
N-acetylated-alpha-linked acidic dipeptidase 2 NAALAD2 NALD2_HUMAN
Type:
PROTEIN
Mol. Mass.:
83602.57
Organism:
Homo sapiens (Human)
Description:
ChEMBL_71707
Residue:
740
  
Inhibitor
Name:
BDBM50143072
Synonyms:
(S)-2-[3-((S)-1,3-Dicarboxy-1-methyl-propyl)-ureido]-2-methyl-pentanedioic acid | CHEMBL45640
Type:
Small organic molecule
Emp. Form.:
C13H20N2O9
Mol. Mass.:
348.3059
SMILES:
C[C@@](CCC(O)=O)(NC(=O)N[C@@](C)(CCC(O)=O)C(O)=O)C(O)=O
: