Target
Neuronal acetylcholine receptor subunit alpha-4/beta-2
Ligand
BDBM50143299
Substrate
Meas. Tech.
ChEMBL_177560 (CHEMBL784318)
IC50
580±n/a nM
Citation
 Crooks, PAAyers, JTXu, RSumithran, SPGrinevich, VPWilkins, LHDeaciuc, AGAllen, DDDwoskin, LP Development of subtype-selective ligands as antagonists at nicotinic receptors mediating nicotine-evoked dopamine release. Bioorg Med Chem Lett 14:1869-74 (2004)  
Target
Name:
Neuronal acetylcholine receptor subunit alpha-4/beta-2
Synonyms:
Neuronal acetylcholine receptor alpha4/beta2 Neuronal acetylcholine receptor; alpha4/beta2
Type:
Mol. Mass.:
Description:
Components:
This complex has 0 components.
Component 1
Name:
Neuronal acetylcholine receptor subunit alpha-4
Synonyms:
ACHA4_RAT Cholinergic, Nicotinic Alpha4Beta2 Chrna4 Neuronal acetylcholine receptor (alpha4beta2 nAChR) Neuronal acetylcholine receptor subunit alpha 4 beta 2 | Neuronal acetylcholine receptor subunit alpha-4
Type:
Enzyme
Mol. Mass.:
70196.44
Organism:
Rattus norvegicus (Rat)
Description:
P09483
Residue:
630
  
Component 2
Name:
Neuronal acetylcholine receptor subunit beta-2
Synonyms:
ACHB2_RAT Chrnb2 Neuronal acetylcholine receptor non-alpha-1 chain
Type:
Enzyme
Mol. Mass.:
56910.32
Organism:
Rattus norvegicus (Rat)
Description:
P12390
Residue:
500
  
Inhibitor
Name:
BDBM50143299
Synonyms:
(3aS,9bR)-8-Decyl-1-methyl-2,3,3a,4,5,9b-hexahydro-1H-pyrrolo[3,2-h]isoquinolin-8-ium; iodide CHEMBL57108
Type:
Small organic molecule
Emp. Form.:
C22H37N2
Mol. Mass.:
329.542
SMILES:
CCCCCCCCCC[n+]1ccc2CC[C@H]3CCN(C)[C@H]3c2c1
: