Target
Methionine--tRNA ligase, cytoplasmic
Ligand
BDBM50143329
Substrate
Meas. Tech.
ChEMBL_105282 (CHEMBL878198)
IC50
70±n/a nM
Citation
 Tandon, MCoffen, DLGallant, PKeith, DAshwell, MA Potent and selective inhibitors of bacterial methionyl tRNA synthetase derived from an oxazolone-dipeptide scaffold. Bioorg Med Chem Lett 14:1909-11 (2004)  
Target
Name:
Methionine--tRNA ligase, cytoplasmic
Synonyms:
MARS Methionyl-tRNA synthetase | SYMC_HUMAN
Type:
PROTEIN
Mol. Mass.:
101110.04
Organism:
Homo sapiens (Human)
Description:
ChEMBL_105283
Residue:
900
  
Inhibitor
Name:
BDBM50143329
Synonyms:
(S)-1-[2-(2,4-Dichloro-phenyl)-5-oxo-oxazol-(4Z)-ylidenemethyl]-azetidine-2-carboxylic acid [(S)-1-carbamoyl-2-(4-hydroxy-phenyl)-ethyl]-amide CHEMBL57382
Type:
Small organic molecule
Emp. Form.:
C23H20Cl2N4O5
Mol. Mass.:
503.335
SMILES:
NC(=O)[C@H](Cc1ccc(O)cc1)NC(=O)[C@@H]1CCN1\C=C1/N=C(OC1=O)c1ccc(Cl)cc1Cl
: